{"text_format":"1","workbook":"xlsx","n_sheets":7,"sheets":["Betrieb","Ford. & TA.","Verbind.","TP. & Schulden","Warenvorrat","Tiere","Stammdaten"],"not_rendered":{"charts":0,"images":2,"macros":1,"external_links":0,"defined_names":0,"comments":0,"pivot_tables":0},"unopened":[],"bounds":{"document_bytes":16777216,"sheet_cells":100000,"rows_first":2000,"rows_last":500,"rows_between":2000,"halvings":0,"cell_chars":16384,"cell_head_chars":4096},"cells_cut":0,"cells_raw":0,"read":"whole","date_system":"1900"}

{"sheet":"Betrieb","index":0,"n_rows":8,"n_cols":1,"rows_kept":8,"cut":false,"hidden":false,"merged":[]}
["Firma"]
["Name, Vorname"]
["Strasse"]
["PLZ / Ort"]
["Telefon"]
["E-Mail"]
[]
["Abschlussdatum"]

{"sheet":"Ford. & TA.","index":1,"n_rows":47,"n_cols":7,"rows_kept":47,"cut":false,"hidden":false,"merged":[[45,2,45,4],[40,0,40,1],[41,0,41,1],[42,0,42,1],[43,0,43,1],[44,0,44,1],[45,0,45,1],[40,2,40,4],[41,2,41,4],[42,2,42,4],[43,2,43,4],[44,2,44,4],[39,0,39,1],[38,2,38,4],[39,2,39,4],[30,0,30,1],[30,2,30,4],[31,0,31,1],[31,2,31,4],[35,0,35,1],[35,2,35,4],[36,0,36,1],[36,2,36,4],[37,0,37,1],[37,2,37,4],[38,0,38,1],[27,0,27,1],[27,2,27,4],[28,0,28,1],[28,2,28,4],[29,0,29,1],[29,2,29,4],[24,0,24,1],[24,2,24,4],[25,0,25,1],[25,2,25,4],[26,0,26,1],[26,2,26,4],[21,0,21,1],[21,2,21,4],[22,0,22,1],[22,2,22,4],[23,0,23,1],[23,2,23,4],[18,0,18,1],[18,2,18,4],[19,0,19,1],[19,2,19,4],[20,0,20,1],[20,2,20,4],[15,0,15,1],[15,2,15,4],[16,0,16,1],[16,2,16,4],[17,0,17,1],[17,2,17,4],[12,0,12,1],[12,2,12,4],[13,0,13,1],[13,2,13,4],[14,0,14,1],[14,2,14,4],[9,0,9,1],[9,2,9,4],[10,0,10,1],[10,2,10,4],[11,0,11,1],[11,2,11,4],[6,0,6,1],[6,2,6,4],[7,0,7,1],[7,2,7,4],[8,0,8,1],[8,2,8,4],[3,0,3,1],[3,2,3,4],[4,0,4,1],[4,2,4,4],[5,0,5,1],[5,2,5,4]]}
[{"$f":"Betrieb!B1","v":0},{"$f":"Betrieb!B2","v":0},{"$f":"Betrieb!B3","v":0},{"$f":"Betrieb!B4","v":0},{"$f":"Betrieb!B5","v":0},{"$f":"Betrieb!B6","v":0},{"$f":"Betrieb!B8","v":"00:00:00"}]
[]
["Offene Forderungen"]
["Name des Schuldners",null,"Genaue Bezeichung des Guthabens",null,null,"Betrag inkl. MWST","Betrag ohne MWST"]
[]
[]
[]
[]
[]
[]
[]
[]
[]
[]
[]
[]
[]
[]
[]
[]
[]
[]
[]
[]
[]
[]
[]
[]
[]
[]
[]
[]
["Total Forderungen",null,null,null,null,{"$f":"SUM(F5:F32)","v":0},{"$f":"SUM(G5:G32)","v":0}]
[]
["Aktive Rechnungsabgrenzung"]
["Rechnungssteller",null,"Genaue Bezeichung und Art der Vorauszahlung",null,null,"Betrag inkl. MWST","Betrag ohne MWST"]
[]
[]
[]
[]
{"$rows_left_out":8}
{"sheet":"Verbind.","index":2,"n_rows":47,"n_cols":7,"rows_kept":47,"cut":false,"hidden":false,"merged":[[17,2,17,4],[18,2,18,4],[35,0,35,1],[35,2,35,4],[28,2,28,4],[24,0,24,1],[24,2,24,4],[25,0,25,1],[25,2,25,4],[26,0,26,1],[26,2,26,4],[27,0,27,1],[27,2,27,4],[28,0,28,1],[17,0,17,1],[18,0,18,1],[19,0,19,1],[20,0,20,1],[21,0,21,1],[33,0,33,1],[30,0,30,1],[22,0,22,1],[33,2,33,4],[34,0,34,1],[34,2,34,4],[38,0,38,1],[38,2,38,4],[36,0,36,1],[36,2,36,4],[37,0,37,1],[37,2,37,4],[30,2,30,4],[31,0,31,1],[31,2,31,4],[32,0,32,1],[32,2,32,4],[44,0,44,1],[44,2,44,4],[45,0,45,1],[45,2,45,4],[41,0,41,1],[41,2,41,4],[42,0,42,1],[42,2,42,4],[43,0,43,1],[43,2,43,4],[39,0,39,1],[39,2,39,4],[40,0,40,1],[40,2,40,4],[15,0,15,1],[15,2,15,4],[16,0,16,1],[16,2,16,4],[23,0,23,1],[23,2,23,4],[19,2,19,4],[20,2,20,4],[21,2,21,4],[22,2,22,4],[29,0,29,1],[29,2,29,4],[12,0,12,1],[12,2,12,4],[13,0,13,1],[13,2,13,4],[14,0,14,1],[14,2,14,4],[9,0,9,1],[9,2,9,4],[10,0,10,1],[10,2,10,4],[11,0,11,1],[11,2,11,4],[6,0,6,1],[6,2,6,4],[7,0,7,1],[7,2,7,4],[8,0,8,1],[8,2,8,4],[4,0,4,1],[4,2,4,4],[3,0,3,1],[3,2,3,4],[5,0,5,1],[5,2,5,4]]}
[{"$f":"Betrieb!B1","v":0},{"$f":"Betrieb!B2","v":0},{"$f":"Betrieb!B3","v":0},{"$f":"Betrieb!B4","v":0},{"$f":"Betrieb!B5","v":0},{"$f":"Betrieb!B6","v":0},{"$f":"Betrieb!B8","v":"00:00:00"}]
[]
["Offene Verbindlichkeiten"]
["Name des Gläubigers",null,"Genaue Bezeichung der Schuld",null,null,"Betrag inkl. MWST","Betrag ohne MWST"]
[]
[]
[]
[]
[]
[]
[]
[]
[]
[]
[]
[]
[]
[]
[]
[]
[]
[]
[]
[]
[]
[]
[]
[]
[]
[]
[]
[]
[]
[]
[]
[]
[]
[]
[]
[]
{"$rows_left_out":8}
{"sheet":"TP. & Schulden","index":3,"n_rows":47,"n_cols":7,"rows_kept":47,"cut":false,"hidden":false,"merged":[[42,2,42,4],[43,2,43,4],[44,2,44,4],[45,2,45,4],[37,2,37,4],[39,2,39,4],[40,2,40,4],[41,2,41,4],[45,0,45,1],[27,0,27,1],[30,0,30,1],[31,0,31,1],[32,0,32,1],[33,0,33,1],[34,0,34,1],[35,0,35,1],[38,0,38,1],[40,0,40,1],[41,0,41,1],[42,0,42,1],[43,0,43,1],[44,0,44,1],[27,2,27,4],[36,0,36,1],[36,2,36,4],[37,0,37,1],[39,0,39,1],[28,0,28,1],[28,2,28,4],[29,0,29,1],[29,2,29,4],[30,2,30,4],[31,2,31,4],[32,2,32,4],[33,2,33,4],[34,2,34,4],[35,2,35,4],[38,2,38,4],[21,0,21,1],[21,2,21,4],[22,0,22,1],[22,2,22,4],[26,0,26,1],[26,2,26,4],[18,0,18,1],[18,2,18,4],[19,0,19,1],[19,2,19,4],[20,0,20,1],[20,2,20,4],[16,0,16,1],[16,2,16,4],[17,0,17,1],[17,2,17,4],[15,0,15,1],[15,2,15,4],[12,0,12,1],[12,2,12,4],[13,0,13,1],[13,2,13,4],[14,0,14,1],[14,2,14,4],[9,0,9,1],[9,2,9,4],[10,0,10,1],[10,2,10,4],[11,0,11,1],[11,2,11,4],[6,0,6,1],[6,2,6,4],[7,0,7,1],[7,2,7,4],[8,0,8,1],[8,2,8,4],[3,0,3,1],[3,2,3,4],[4,0,4,1],[4,2,4,4],[5,0,5,1],[5,2,5,4]]}
[{"$f":"Betrieb!B1","v":0},{"$f":"Betrieb!B2","v":0},{"$f":"Betrieb!B3","v":0},{"$f":"Betrieb!B4","v":0},{"$f":"Betrieb!B5","v":0},{"$f":"Betrieb!B6","v":0},{"$f":"Betrieb!B8","v":"00:00:00"}]
[]
["Passive Rechnungsabgrenzung"]
["Gläubiger / Vorauszahler",null,"Genaue Bezeichung der Vorauszahlung",null,null,"Betrag inkl. MWST","Betrag ohne MWST"]
[]
[]
[]
[]
[]
[]
[]
[]
[]
[]
[]
[]
[]
[]
[]
[]
[]
[]
[]
["Total Passive Rechnungsabgrenzung",null,null,null,null,{"$f":"SUM(F5:F23)","v":0},{"$f":"SUM(G5:G23)","v":0}]
[]
["Schulden"]
["Rechnungssteller",null,"Genaue Bezeichung und Zinssatz",null,null,"Rückzahlungsdatum","Betrag ohne MWST"]
[]
[]
[]
[]
[]
[]
[]
[]
[]
[]
[]
[]
[]
{"$rows_left_out":8}
{"sheet":"Warenvorrat","index":4,"n_rows":47,"n_cols":7,"rows_kept":47,"cut":false,"hidden":false,"merged":[[45,0,45,2],[3,0,3,2],[2,5,2,6],[4,0,4,2],[5,0,5,2],[6,0,6,2],[7,0,7,2],[8,0,8,2],[9,0,9,2],[42,0,42,2],[43,0,43,2],[44,0,44,2],[39,0,39,2],[40,0,40,2],[41,0,41,2],[36,0,36,2],[37,0,37,2],[38,0,38,2],[33,0,33,2],[34,0,34,2],[35,0,35,2],[30,0,30,2],[31,0,31,2],[32,0,32,2],[27,0,27,2],[28,0,28,2],[29,0,29,2],[24,0,24,2],[25,0,25,2],[26,0,26,2],[21,0,21,2],[22,0,22,2],[23,0,23,2],[18,0,18,2],[19,0,19,2],[20,0,20,2],[15,0,15,2],[16,0,16,2],[17,0,17,2],[12,0,12,2],[13,0,13,2],[14,0,14,2],[10,0,10,2],[11,0,11,2]]}
[{"$f":"Betrieb!B1","v":0},{"$f":"Betrieb!B2","v":0},{"$f":"Betrieb!B3","v":0},{"$f":"Betrieb!B4","v":0},{"$f":"Betrieb!B5","v":0},{"$f":"Betrieb!B6","v":0},{"$f":"Betrieb!B8","v":"00:00:00"}]
[]
["Material- und Warenvorrat",null,null,null,null,"Preise ohne MWST"]
["Bezeichung der Material- und Warenvorräte",null,null,"Menge","Einheit","Ankaufspreis ","Betrag"]
[null,null,null,null,null,null,{"$f":"D5*F5","v":0}]
[null,null,null,null,null,null,{"$f":"D6*F6","v":0}]
[null,null,null,null,null,null,{"$f":"D7*F7","v":0}]
[null,null,null,null,null,null,0]
[null,null,null,null,null,null,0]
[null,null,null,null,null,null,0]
[null,null,null,null,null,null,0]
[null,null,null,null,null,null,0]
[null,null,null,null,null,null,0]
[null,null,null,null,null,null,0]
[null,null,null,null,null,null,0]
[null,null,null,null,null,null,0]
[null,null,null,null,null,null,0]
[null,null,null,null,null,null,0]
[null,null,null,null,null,null,0]
[null,null,null,null,null,null,0]
[null,null,null,null,null,null,0]
[null,null,null,null,null,null,0]
[null,null,null,null,null,null,0]
[null,null,null,null,null,null,0]
[null,null,null,null,null,null,0]
[null,null,null,null,null,null,0]
[null,null,null,null,null,null,0]
[null,null,null,null,null,null,0]
[null,null,null,null,null,null,0]
[null,null,null,null,null,null,0]
[null,null,null,null,null,null,0]
[null,null,null,null,null,null,0]
[null,null,null,null,null,null,0]
[null,null,null,null,null,null,0]
[null,null,null,null,null,null,0]
[null,null,null,null,null,null,0]
[null,null,null,null,null,null,0]
[null,null,null,null,null,null,0]
[null,null,null,null,null,null,0]
[null,null,null,null,null,null,0]
{"$rows_left_out":8}
{"sheet":"Tiere","index":5,"n_rows":47,"n_cols":8,"rows_kept":47,"cut":false,"hidden":false,"merged":[[44,1,44,3],[45,1,45,3],[46,1,46,6],[38,1,38,3],[39,1,39,3],[40,1,40,3],[41,1,41,3],[42,1,42,3],[43,1,43,3],[37,1,37,3],[26,1,26,3],[27,1,27,3],[28,1,28,3],[29,1,29,3],[30,1,30,3],[31,1,31,3],[32,1,32,3],[33,1,33,3],[34,1,34,3],[35,1,35,3],[36,1,36,3],[25,1,25,3],[14,1,14,3],[15,1,15,3],[16,1,16,3],[17,1,17,3],[18,1,18,3],[19,1,19,3],[20,1,20,3],[21,1,21,3],[22,1,22,3],[23,1,23,3],[24,1,24,3],[13,1,13,3],[2,6,2,7],[3,1,3,3],[4,1,4,3],[5,1,5,3],[6,1,6,3],[7,1,7,3],[8,1,8,3],[9,1,9,3],[10,1,10,3],[11,1,11,3],[12,1,12,3]]}
[null,{"$f":"Betrieb!B1","v":0},{"$f":"Betrieb!B2","v":0},{"$f":"Betrieb!B3","v":0},{"$f":"Betrieb!B4","v":0},{"$f":"Betrieb!B5","v":0},{"$f":"Betrieb!B6","v":0},{"$f":"Betrieb!B8","v":"00:00:00"}]
[]
[null,"Tiere"]
[null,"Bitte Tiergattung wählen",null,null,"Anzahl","Alter","Wert pro Tier","Betrag"]
[0,{"$f":"IF(VLOOKUP(A5,Stammdaten!$A$4:$D$35,2,FALSE)=0,\" \",VLOOKUP(A5,Stammdaten!$A$4:$D$35,2,FALSE))","v":" "},null,null,null,{"$f":"IF(VLOOKUP(A5,Stammdaten!$A$4:$D$35,3,FALSE)=0,\" \",VLOOKUP(A5,Stammdaten!$A$4:$D$35,3,FALSE))","v":" "},{"$f":"IF(VLOOKUP(A5,Stammdaten!$A$4:$D$35,4,FALSE)=0,0,VLOOKUP(A5,Stammdaten!$A$4:$D$35,4,FALSE))","v":0},{"$f":"E5*G5","v":0}]
[0,{"$f":"IF(VLOOKUP(A6,Stammdaten!$A$4:$D$35,2,FALSE)=0,\" \",VLOOKUP(A6,Stammdaten!$A$4:$D$35,2,FALSE))","v":" "},null,null,null,{"$f":"IF(VLOOKUP(A6,Stammdaten!$A$4:$D$35,3,FALSE)=0,\" \",VLOOKUP(A6,Stammdaten!$A$4:$D$35,3,FALSE))","v":" "},{"$f":"IF(VLOOKUP(A6,Stammdaten!$A$4:$D$35,4,FALSE)=0,0,VLOOKUP(A6,Stammdaten!$A$4:$D$35,4,FALSE))","v":0},{"$f":"E6*G6","v":0}]
[0,{"$f":"IF(VLOOKUP(A7,Stammdaten!$A$4:$D$35,2,FALSE)=0,\" \",VLOOKUP(A7,Stammdaten!$A$4:$D$35,2,FALSE))","v":" "},null,null,null,{"$f":"IF(VLOOKUP(A7,Stammdaten!$A$4:$D$35,3,FALSE)=0,\" \",VLOOKUP(A7,Stammdaten!$A$4:$D$35,3,FALSE))","v":" "},{"$f":"IF(VLOOKUP(A7,Stammdaten!$A$4:$D$35,4,FALSE)=0,0,VLOOKUP(A7,Stammdaten!$A$4:$D$35,4,FALSE))","v":0},{"$f":"E7*G7","v":0}]
[0,{"$f":"IF(VLOOKUP(A8,Stammdaten!$A$4:$D$35,2,FALSE)=0,\" \",VLOOKUP(A8,Stammdaten!$A$4:$D$35,2,FALSE))","v":" "},null,null,null,{"$f":"IF(VLOOKUP(A8,Stammdaten!$A$4:$D$35,3,FALSE)=0,\" \",VLOOKUP(A8,Stammdaten!$A$4:$D$35,3,FALSE))","v":" "},{"$f":"IF(VLOOKUP(A8,Stammdaten!$A$4:$D$35,4,FALSE)=0,0,VLOOKUP(A8,Stammdaten!$A$4:$D$35,4,FALSE))","v":0},0]
[0,{"$f":"IF(VLOOKUP(A9,Stammdaten!$A$4:$D$35,2,FALSE)=0,\" \",VLOOKUP(A9,Stammdaten!$A$4:$D$35,2,FALSE))","v":" "},null,null,null,{"$f":"IF(VLOOKUP(A9,Stammdaten!$A$4:$D$35,3,FALSE)=0,\" \",VLOOKUP(A9,Stammdaten!$A$4:$D$35,3,FALSE))","v":" "},{"$f":"IF(VLOOKUP(A9,Stammdaten!$A$4:$D$35,4,FALSE)=0,0,VLOOKUP(A9,Stammdaten!$A$4:$D$35,4,FALSE))","v":0},0]
[0,{"$f":"IF(VLOOKUP(A10,Stammdaten!$A$4:$D$35,2,FALSE)=0,\" \",VLOOKUP(A10,Stammdaten!$A$4:$D$35,2,FALSE))","v":" "},null,null,null,{"$f":"IF(VLOOKUP(A10,Stammdaten!$A$4:$D$35,3,FALSE)=0,\" \",VLOOKUP(A10,Stammdaten!$A$4:$D$35,3,FALSE))","v":" "},{"$f":"IF(VLOOKUP(A10,Stammdaten!$A$4:$D$35,4,FALSE)=0,0,VLOOKUP(A10,Stammdaten!$A$4:$D$35,4,FALSE))","v":0},0]
[0,{"$f":"IF(VLOOKUP(A11,Stammdaten!$A$4:$D$35,2,FALSE)=0,\" \",VLOOKUP(A11,Stammdaten!$A$4:$D$35,2,FALSE))","v":" "},null,null,null,{"$f":"IF(VLOOKUP(A11,Stammdaten!$A$4:$D$35,3,FALSE)=0,\" \",VLOOKUP(A11,Stammdaten!$A$4:$D$35,3,FALSE))","v":" "},{"$f":"IF(VLOOKUP(A11,Stammdaten!$A$4:$D$35,4,FALSE)=0,0,VLOOKUP(A11,Stammdaten!$A$4:$D$35,4,FALSE))","v":0},0]
[0,{"$f":"IF(VLOOKUP(A12,Stammdaten!$A$4:$D$35,2,FALSE)=0,\" \",VLOOKUP(A12,Stammdaten!$A$4:$D$35,2,FALSE))","v":" "},null,null,null,{"$f":"IF(VLOOKUP(A12,Stammdaten!$A$4:$D$35,3,FALSE)=0,\" \",VLOOKUP(A12,Stammdaten!$A$4:$D$35,3,FALSE))","v":" "},{"$f":"IF(VLOOKUP(A12,Stammdaten!$A$4:$D$35,4,FALSE)=0,0,VLOOKUP(A12,Stammdaten!$A$4:$D$35,4,FALSE))","v":0},0]
[0,{"$f":"IF(VLOOKUP(A13,Stammdaten!$A$4:$D$35,2,FALSE)=0,\" \",VLOOKUP(A13,Stammdaten!$A$4:$D$35,2,FALSE))","v":" "},null,null,null,{"$f":"IF(VLOOKUP(A13,Stammdaten!$A$4:$D$35,3,FALSE)=0,\" \",VLOOKUP(A13,Stammdaten!$A$4:$D$35,3,FALSE))","v":" "},{"$f":"IF(VLOOKUP(A13,Stammdaten!$A$4:$D$35,4,FALSE)=0,0,VLOOKUP(A13,Stammdaten!$A$4:$D$35,4,FALSE))","v":0},0]
[0,{"$f":"IF(VLOOKUP(A14,Stammdaten!$A$4:$D$35,2,FALSE)=0,\" \",VLOOKUP(A14,Stammdaten!$A$4:$D$35,2,FALSE))","v":" "},null,null,null,{"$f":"IF(VLOOKUP(A14,Stammdaten!$A$4:$D$35,3,FALSE)=0,\" \",VLOOKUP(A14,Stammdaten!$A$4:$D$35,3,FALSE))","v":" "},{"$f":"IF(VLOOKUP(A14,Stammdaten!$A$4:$D$35,4,FALSE)=0,0,VLOOKUP(A14,Stammdaten!$A$4:$D$35,4,FALSE))","v":0},0]
[0,{"$f":"IF(VLOOKUP(A15,Stammdaten!$A$4:$D$35,2,FALSE)=0,\" \",VLOOKUP(A15,Stammdaten!$A$4:$D$35,2,FALSE))","v":" "},null,null,null,{"$f":"IF(VLOOKUP(A15,Stammdaten!$A$4:$D$35,3,FALSE)=0,\" \",VLOOKUP(A15,Stammdaten!$A$4:$D$35,3,FALSE))","v":" "},{"$f":"IF(VLOOKUP(A15,Stammdaten!$A$4:$D$35,4,FALSE)=0,0,VLOOKUP(A15,Stammdaten!$A$4:$D$35,4,FALSE))","v":0},0]
[0,{"$f":"IF(VLOOKUP(A16,Stammdaten!$A$4:$D$35,2,FALSE)=0,\" \",VLOOKUP(A16,Stammdaten!$A$4:$D$35,2,FALSE))","v":" "},null,null,null,{"$f":"IF(VLOOKUP(A16,Stammdaten!$A$4:$D$35,3,FALSE)=0,\" \",VLOOKUP(A16,Stammdaten!$A$4:$D$35,3,FALSE))","v":" "},{"$f":"IF(VLOOKUP(A16,Stammdaten!$A$4:$D$35,4,FALSE)=0,0,VLOOKUP(A16,Stammdaten!$A$4:$D$35,4,FALSE))","v":0},0]
[0,{"$f":"IF(VLOOKUP(A17,Stammdaten!$A$4:$D$35,2,FALSE)=0,\" \",VLOOKUP(A17,Stammdaten!$A$4:$D$35,2,FALSE))","v":" "},null,null,null,{"$f":"IF(VLOOKUP(A17,Stammdaten!$A$4:$D$35,3,FALSE)=0,\" \",VLOOKUP(A17,Stammdaten!$A$4:$D$35,3,FALSE))","v":" "},{"$f":"IF(VLOOKUP(A17,Stammdaten!$A$4:$D$35,4,FALSE)=0,0,VLOOKUP(A17,Stammdaten!$A$4:$D$35,4,FALSE))","v":0},0]
[0,{"$f":"IF(VLOOKUP(A18,Stammdaten!$A$4:$D$35,2,FALSE)=0,\" \",VLOOKUP(A18,Stammdaten!$A$4:$D$35,2,FALSE))","v":" "},null,null,null,{"$f":"IF(VLOOKUP(A18,Stammdaten!$A$4:$D$35,3,FALSE)=0,\" \",VLOOKUP(A18,Stammdaten!$A$4:$D$35,3,FALSE))","v":" "},{"$f":"IF(VLOOKUP(A18,Stammdaten!$A$4:$D$35,4,FALSE)=0,0,VLOOKUP(A18,Stammdaten!$A$4:$D$35,4,FALSE))","v":0},0]
[0,{"$f":"IF(VLOOKUP(A19,Stammdaten!$A$4:$D$35,2,FALSE)=0,\" \",VLOOKUP(A19,Stammdaten!$A$4:$D$35,2,FALSE))","v":" "},null,null,null,{"$f":"IF(VLOOKUP(A19,Stammdaten!$A$4:$D$35,3,FALSE)=0,\" \",VLOOKUP(A19,Stammdaten!$A$4:$D$35,3,FALSE))","v":" "},{"$f":"IF(VLOOKUP(A19,Stammdaten!$A$4:$D$35,4,FALSE)=0,0,VLOOKUP(A19,Stammdaten!$A$4:$D$35,4,FALSE))","v":0},0]
[0,{"$f":"IF(VLOOKUP(A20,Stammdaten!$A$4:$D$35,2,FALSE)=0,\" \",VLOOKUP(A20,Stammdaten!$A$4:$D$35,2,FALSE))","v":" "},null,null,null,{"$f":"IF(VLOOKUP(A20,Stammdaten!$A$4:$D$35,3,FALSE)=0,\" \",VLOOKUP(A20,Stammdaten!$A$4:$D$35,3,FALSE))","v":" "},{"$f":"IF(VLOOKUP(A20,Stammdaten!$A$4:$D$35,4,FALSE)=0,0,VLOOKUP(A20,Stammdaten!$A$4:$D$35,4,FALSE))","v":0},0]
[0,{"$f":"IF(VLOOKUP(A21,Stammdaten!$A$4:$D$35,2,FALSE)=0,\" \",VLOOKUP(A21,Stammdaten!$A$4:$D$35,2,FALSE))","v":" "},null,null,null,{"$f":"IF(VLOOKUP(A21,Stammdaten!$A$4:$D$35,3,FALSE)=0,\" \",VLOOKUP(A21,Stammdaten!$A$4:$D$35,3,FALSE))","v":" "},{"$f":"IF(VLOOKUP(A21,Stammdaten!$A$4:$D$35,4,FALSE)=0,0,VLOOKUP(A21,Stammdaten!$A$4:$D$35,4,FALSE))","v":0},0]
[0,{"$f":"IF(VLOOKUP(A22,Stammdaten!$A$4:$D$35,2,FALSE)=0,\" \",VLOOKUP(A22,Stammdaten!$A$4:$D$35,2,FALSE))","v":" "},null,null,null,{"$f":"IF(VLOOKUP(A22,Stammdaten!$A$4:$D$35,3,FALSE)=0,\" \",VLOOKUP(A22,Stammdaten!$A$4:$D$35,3,FALSE))","v":" "},{"$f":"IF(VLOOKUP(A22,Stammdaten!$A$4:$D$35,4,FALSE)=0,0,VLOOKUP(A22,Stammdaten!$A$4:$D$35,4,FALSE))","v":0},0]
[0,{"$f":"IF(VLOOKUP(A23,Stammdaten!$A$4:$D$35,2,FALSE)=0,\" \",VLOOKUP(A23,Stammdaten!$A$4:$D$35,2,FALSE))","v":" "},null,null,null,{"$f":"IF(VLOOKUP(A23,Stammdaten!$A$4:$D$35,3,FALSE)=0,\" \",VLOOKUP(A23,Stammdaten!$A$4:$D$35,3,FALSE))","v":" "},{"$f":"IF(VLOOKUP(A23,Stammdaten!$A$4:$D$35,4,FALSE)=0,0,VLOOKUP(A23,Stammdaten!$A$4:$D$35,4,FALSE))","v":0},0]
[0,{"$f":"IF(VLOOKUP(A24,Stammdaten!$A$4:$D$35,2,FALSE)=0,\" \",VLOOKUP(A24,Stammdaten!$A$4:$D$35,2,FALSE))","v":" "},null,null,null,{"$f":"IF(VLOOKUP(A24,Stammdaten!$A$4:$D$35,3,FALSE)=0,\" \",VLOOKUP(A24,Stammdaten!$A$4:$D$35,3,FALSE))","v":" "},{"$f":"IF(VLOOKUP(A24,Stammdaten!$A$4:$D$35,4,FALSE)=0,0,VLOOKUP(A24,Stammdaten!$A$4:$D$35,4,FALSE))","v":0},0]
[0,{"$f":"IF(VLOOKUP(A25,Stammdaten!$A$4:$D$35,2,FALSE)=0,\" \",VLOOKUP(A25,Stammdaten!$A$4:$D$35,2,FALSE))","v":" "},null,null,null,{"$f":"IF(VLOOKUP(A25,Stammdaten!$A$4:$D$35,3,FALSE)=0,\" \",VLOOKUP(A25,Stammdaten!$A$4:$D$35,3,FALSE))","v":" "},{"$f":"IF(VLOOKUP(A25,Stammdaten!$A$4:$D$35,4,FALSE)=0,0,VLOOKUP(A25,Stammdaten!$A$4:$D$35,4,FALSE))","v":0},0]
[0,{"$f":"IF(VLOOKUP(A26,Stammdaten!$A$4:$D$35,2,FALSE)=0,\" \",VLOOKUP(A26,Stammdaten!$A$4:$D$35,2,FALSE))","v":" "},null,null,null,{"$f":"IF(VLOOKUP(A26,Stammdaten!$A$4:$D$35,3,FALSE)=0,\" \",VLOOKUP(A26,Stammdaten!$A$4:$D$35,3,FALSE))","v":" "},{"$f":"IF(VLOOKUP(A26,Stammdaten!$A$4:$D$35,4,FALSE)=0,0,VLOOKUP(A26,Stammdaten!$A$4:$D$35,4,FALSE))","v":0},0]
[0,{"$f":"IF(VLOOKUP(A27,Stammdaten!$A$4:$D$35,2,FALSE)=0,\" \",VLOOKUP(A27,Stammdaten!$A$4:$D$35,2,FALSE))","v":" "},null,null,null,{"$f":"IF(VLOOKUP(A27,Stammdaten!$A$4:$D$35,3,FALSE)=0,\" \",VLOOKUP(A27,Stammdaten!$A$4:$D$35,3,FALSE))","v":" "},{"$f":"IF(VLOOKUP(A27,Stammdaten!$A$4:$D$35,4,FALSE)=0,0,VLOOKUP(A27,Stammdaten!$A$4:$D$35,4,FALSE))","v":0},0]
[0,{"$f":"IF(VLOOKUP(A28,Stammdaten!$A$4:$D$35,2,FALSE)=0,\" \",VLOOKUP(A28,Stammdaten!$A$4:$D$35,2,FALSE))","v":" "},null,null,null,{"$f":"IF(VLOOKUP(A28,Stammdaten!$A$4:$D$35,3,FALSE)=0,\" \",VLOOKUP(A28,Stammdaten!$A$4:$D$35,3,FALSE))","v":" "},{"$f":"IF(VLOOKUP(A28,Stammdaten!$A$4:$D$35,4,FALSE)=0,0,VLOOKUP(A28,Stammdaten!$A$4:$D$35,4,FALSE))","v":0},0]
[0,{"$f":"IF(VLOOKUP(A29,Stammdaten!$A$4:$D$35,2,FALSE)=0,\" \",VLOOKUP(A29,Stammdaten!$A$4:$D$35,2,FALSE))","v":" "},null,null,null,{"$f":"IF(VLOOKUP(A29,Stammdaten!$A$4:$D$35,3,FALSE)=0,\" \",VLOOKUP(A29,Stammdaten!$A$4:$D$35,3,FALSE))","v":" "},{"$f":"IF(VLOOKUP(A29,Stammdaten!$A$4:$D$35,4,FALSE)=0,0,VLOOKUP(A29,Stammdaten!$A$4:$D$35,4,FALSE))","v":0},0]
[0,{"$f":"IF(VLOOKUP(A30,Stammdaten!$A$4:$D$35,2,FALSE)=0,\" \",VLOOKUP(A30,Stammdaten!$A$4:$D$35,2,FALSE))","v":" "},null,null,null,{"$f":"IF(VLOOKUP(A30,Stammdaten!$A$4:$D$35,3,FALSE)=0,\" \",VLOOKUP(A30,Stammdaten!$A$4:$D$35,3,FALSE))","v":" "},{"$f":"IF(VLOOKUP(A30,Stammdaten!$A$4:$D$35,4,FALSE)=0,0,VLOOKUP(A30,Stammdaten!$A$4:$D$35,4,FALSE))","v":0},0]
[0,{"$f":"IF(VLOOKUP(A31,Stammdaten!$A$4:$D$35,2,FALSE)=0,\" \",VLOOKUP(A31,Stammdaten!$A$4:$D$35,2,FALSE))","v":" "},null,null,null,{"$f":"IF(VLOOKUP(A31,Stammdaten!$A$4:$D$35,3,FALSE)=0,\" \",VLOOKUP(A31,Stammdaten!$A$4:$D$35,3,FALSE))","v":" "},{"$f":"IF(VLOOKUP(A31,Stammdaten!$A$4:$D$35,4,FALSE)=0,0,VLOOKUP(A31,Stammdaten!$A$4:$D$35,4,FALSE))","v":0},0]
[0,{"$f":"IF(VLOOKUP(A32,Stammdaten!$A$4:$D$35,2,FALSE)=0,\" \",VLOOKUP(A32,Stammdaten!$A$4:$D$35,2,FALSE))","v":" "},null,null,null,{"$f":"IF(VLOOKUP(A32,Stammdaten!$A$4:$D$35,3,FALSE)=0,\" \",VLOOKUP(A32,Stammdaten!$A$4:$D$35,3,FALSE))","v":" "},{"$f":"IF(VLOOKUP(A32,Stammdaten!$A$4:$D$35,4,FALSE)=0,0,VLOOKUP(A32,Stammdaten!$A$4:$D$35,4,FALSE))","v":0},0]
[0,{"$f":"IF(VLOOKUP(A33,Stammdaten!$A$4:$D$35,2,FALSE)=0,\" \",VLOOKUP(A33,Stammdaten!$A$4:$D$35,2,FALSE))","v":" "},null,null,null,{"$f":"IF(VLOOKUP(A33,Stammdaten!$A$4:$D$35,3,FALSE)=0,\" \",VLOOKUP(A33,Stammdaten!$A$4:$D$35,3,FALSE))","v":" "},{"$f":"IF(VLOOKUP(A33,Stammdaten!$A$4:$D$35,4,FALSE)=0,0,VLOOKUP(A33,Stammdaten!$A$4:$D$35,4,FALSE))","v":0},0]
[0,{"$f":"IF(VLOOKUP(A34,Stammdaten!$A$4:$D$35,2,FALSE)=0,\" \",VLOOKUP(A34,Stammdaten!$A$4:$D$35,2,FALSE))","v":" "},null,null,null,{"$f":"IF(VLOOKUP(A34,Stammdaten!$A$4:$D$35,3,FALSE)=0,\" \",VLOOKUP(A34,Stammdaten!$A$4:$D$35,3,FALSE))","v":" "},{"$f":"IF(VLOOKUP(A34,Stammdaten!$A$4:$D$35,4,FALSE)=0,0,VLOOKUP(A34,Stammdaten!$A$4:$D$35,4,FALSE))","v":0},0]
[0,{"$f":"IF(VLOOKUP(A35,Stammdaten!$A$4:$D$35,2,FALSE)=0,\" \",VLOOKUP(A35,Stammdaten!$A$4:$D$35,2,FALSE))","v":" "},null,null,null,{"$f":"IF(VLOOKUP(A35,Stammdaten!$A$4:$D$35,3,FALSE)=0,\" \",VLOOKUP(A35,Stammdaten!$A$4:$D$35,3,FALSE))","v":" "},{"$f":"IF(VLOOKUP(A35,Stammdaten!$A$4:$D$35,4,FALSE)=0,0,VLOOKUP(A35,Stammdaten!$A$4:$D$35,4,FALSE))","v":0},0]
[0,{"$f":"IF(VLOOKUP(A36,Stammdaten!$A$4:$D$35,2,FALSE)=0,\" \",VLOOKUP(A36,Stammdaten!$A$4:$D$35,2,FALSE))","v":" "},null,null,null,{"$f":"IF(VLOOKUP(A36,Stammdaten!$A$4:$D$35,3,FALSE)=0,\" \",VLOOKUP(A36,Stammdaten!$A$4:$D$35,3,FALSE))","v":" "},{"$f":"IF(VLOOKUP(A36,Stammdaten!$A$4:$D$35,4,FALSE)=0,0,VLOOKUP(A36,Stammdaten!$A$4:$D$35,4,FALSE))","v":0},0]
[0,{"$f":"IF(VLOOKUP(A37,Stammdaten!$A$4:$D$35,2,FALSE)=0,\" \",VLOOKUP(A37,Stammdaten!$A$4:$D$35,2,FALSE))","v":" "},null,null,null,{"$f":"IF(VLOOKUP(A37,Stammdaten!$A$4:$D$35,3,FALSE)=0,\" \",VLOOKUP(A37,Stammdaten!$A$4:$D$35,3,FALSE))","v":" "},{"$f":"IF(VLOOKUP(A37,Stammdaten!$A$4:$D$35,4,FALSE)=0,0,VLOOKUP(A37,Stammdaten!$A$4:$D$35,4,FALSE))","v":0},0]
[0,{"$f":"IF(VLOOKUP(A38,Stammdaten!$A$4:$D$35,2,FALSE)=0,\" \",VLOOKUP(A38,Stammdaten!$A$4:$D$35,2,FALSE))","v":" "},null,null,null,{"$f":"IF(VLOOKUP(A38,Stammdaten!$A$4:$D$35,3,FALSE)=0,\" \",VLOOKUP(A38,Stammdaten!$A$4:$D$35,3,FALSE))","v":" "},{"$f":"IF(VLOOKUP(A38,Stammdaten!$A$4:$D$35,4,FALSE)=0,0,VLOOKUP(A38,Stammdaten!$A$4:$D$35,4,FALSE))","v":0},0]
[0,{"$f":"IF(VLOOKUP(A39,Stammdaten!$A$4:$D$35,2,FALSE)=0,\" \",VLOOKUP(A39,Stammdaten!$A$4:$D$35,2,FALSE))","v":" "},null,null,null,{"$f":"IF(VLOOKUP(A39,Stammdaten!$A$4:$D$35,3,FALSE)=0,\" \",VLOOKUP(A39,Stammdaten!$A$4:$D$35,3,FALSE))","v":" "},{"$f":"IF(VLOOKUP(A39,Stammdaten!$A$4:$D$35,4,FALSE)=0,0,VLOOKUP(A39,Stammdaten!$A$4:$D$35,4,FALSE))","v":0},0]
[0,{"$f":"IF(VLOOKUP(A40,Stammdaten!$A$4:$D$35,2,FALSE)=0,\" \",VLOOKUP(A40,Stammdaten!$A$4:$D$35,2,FALSE))","v":" "},null,null,null,{"$f":"IF(VLOOKUP(A40,Stammdaten!$A$4:$D$35,3,FALSE)=0,\" \",VLOOKUP(A40,Stammdaten!$A$4:$D$35,3,FALSE))","v":" "},{"$f":"IF(VLOOKUP(A40,Stammdaten!$A$4:$D$35,4,FALSE)=0,0,VLOOKUP(A40,Stammdaten!$A$4:$D$35,4,FALSE))","v":0},0]
{"$rows_left_out":8}
{"sheet":"Stammdaten","index":6,"n_rows":41,"n_cols":4,"rows_kept":41,"cut":false,"hidden":true,"merged":[]}
[null,"Stammdaten"]
[]
[null,"Tiergattungen"]
[0]
[1,"Kühe ",null,3000]
[2,"Ammen- und Mutterkühe",null,3000]
[3,"Rinder","über 2 jährig",2700]
[4,"Rinder"," 1 - 2 jährig",1800]
[5,"Jungvieh ","1/2 - 1 jährig",900]
[6,"Aufzuchtkälber",null,600]
[7,"Eber",null,300]
[8,"Mutterschweine",null,300]
[9,"Zuchtjager",null,300]
[10,"Ferkel","1 Woche",10]
[11,"Ferkel","2 Wochen",20]
[12,"Ferkel","3 Wochen",30]
[13,"Ferkel","4 Wochen",42.5]
[14,"Ferkel","5 Wochen",55]
[15,"Ferkel","6 Wochen",65]
[16,"Ferkel","7 Wochen",75]
[17,"Ferkel","8 Wochen",92.5]
[18,"Ferkle","9 Wochen",110]
[19,"Jager","20 kg",90]
[21,"Jager","30 kg",130]
[22,"Jager","40 kg",165]
[23,"Mastschweine","50 kg",200]
[24,"Mastschweine","60 kg",230]
[25,"Mastschweine","70 kg",255]
[26,"Mastschweine","80 kg",280]
[27,"Mastschweine","90 kg",300]
[28,"Mastschweine","100 kg",320]
[29,"Binenvölker",null,125]
[30,"Schafe","über 2 jährig",375]
[31,"Lämmer","bis 1 jährig",400]
[32,"Milchziegen",null,200]
[33,"Fohlen","bis 1 jährig",1000]
[34,"Jung Pferde","bis 2 jährig",2000]
[35,"Perde","3 und mehrjährig",2300]
[36,"Zuchtstuten",null,4000]
[37,"Maultiere",null,1000]
{"$rows_left_out":1}